{"text_format":"1","workbook":"xlsx","n_sheets":8,"sheets":["OPINTOKOKONAISUUDET","VUOSISUUNNITELMA","7. LUOKKA","8. LUOKKA","9. LUOKKA","TAVOITTEET","TIEDOT","LUKUVUOSITIEDOT"],"not_rendered":{"charts":0,"images":1,"macros":1,"external_links":0,"defined_names":14,"comments":0,"pivot_tables":0},"unopened":[],"bounds":{"document_bytes":16777216,"sheet_cells":100000,"rows_first":2000,"rows_last":500,"rows_between":2000,"halvings":0,"cell_chars":16384,"cell_head_chars":4096},"cells_cut":0,"cells_raw":0,"read":"whole","date_system":"1900"}

{"sheet":"OPINTOKOKONAISUUDET","index":0,"n_rows":252,"n_cols":10,"rows_kept":252,"cut":false,"hidden":false,"merged":[[3,1,4,2]]}
[]
[null,"Kuvataiteen opintokokonaisuudet"]
[]
[null,"Aloita antamalla opintokokonaisuudelle numero (1-50) ja nimi. Saat lisätietoja klikkaamalla sarakeotsikoita."]
[]
[]
[null,"OPINTOKOKONAISUUS","NIMI","TAVOITE","ARVIOINNIN KOHDE","TAVOITETEKSTI","SISÄLTÖ","TOTEUTUS","ARVIOINTITAPA","LISÄTIEDOT"]
[null,null,null,null,{"$f":"IF(ISNA(VLOOKUP(D8,TAVOITTEET!B$2:D$12,2,FALSE)) = TRUE, \"\", VLOOKUP(D8,TAVOITTEET!B$2:D$12,2,FALSE))","v":""},{"$f":"IF(ISNA(VLOOKUP(D8,TAVOITTEET!B$2:E$12,3,FALSE)) = TRUE, \"\", VLOOKUP(D8,TAVOITTEET!B$2:E$12,3,FALSE))","v":""}]
[null,null,null,null,{"$f":"IF(ISNA(VLOOKUP(D9,TAVOITTEET!B$2:D$12,2,FALSE)) = TRUE, \"\", VLOOKUP(D9,TAVOITTEET!B$2:D$12,2,FALSE))","v":""},{"$f":"IF(ISNA(VLOOKUP(D9,TAVOITTEET!B$2:E$12,3,FALSE)) = TRUE, \"\", VLOOKUP(D9,TAVOITTEET!B$2:E$12,3,FALSE))","v":""}]
[null,null,null,null,{"$f":"IF(ISNA(VLOOKUP(D10,TAVOITTEET!B$2:D$12,2,FALSE)) = TRUE, \"\", VLOOKUP(D10,TAVOITTEET!B$2:D$12,2,FALSE))","v":""},{"$f":"IF(ISNA(VLOOKUP(D10,TAVOITTEET!B$2:E$12,3,FALSE)) = TRUE, \"\", VLOOKUP(D10,TAVOITTEET!B$2:E$12,3,FALSE))","v":""}]
[null,null,null,null,{"$f":"IF(ISNA(VLOOKUP(D11,TAVOITTEET!B$2:D$12,2,FALSE)) = TRUE, \"\", VLOOKUP(D11,TAVOITTEET!B$2:D$12,2,FALSE))","v":""},{"$f":"IF(ISNA(VLOOKUP(D11,TAVOITTEET!B$2:E$12,3,FALSE)) = TRUE, \"\", VLOOKUP(D11,TAVOITTEET!B$2:E$12,3,FALSE))","v":""}]
[null,null,null,null,{"$f":"IF(ISNA(VLOOKUP(D12,TAVOITTEET!B$2:D$12,2,FALSE)) = TRUE, \"\", VLOOKUP(D12,TAVOITTEET!B$2:D$12,2,FALSE))","v":""},{"$f":"IF(ISNA(VLOOKUP(D12,TAVOITTEET!B$2:E$12,3,FALSE)) = TRUE, \"\", VLOOKUP(D12,TAVOITTEET!B$2:E$12,3,FALSE))","v":""}]
[null,null,null,null,{"$f":"IF(ISNA(VLOOKUP(D13,TAVOITTEET!B$2:D$12,2,FALSE)) = TRUE, \"\", VLOOKUP(D13,TAVOITTEET!B$2:D$12,2,FALSE))","v":""},{"$f":"IF(ISNA(VLOOKUP(D13,TAVOITTEET!B$2:E$12,3,FALSE)) = TRUE, \"\", VLOOKUP(D13,TAVOITTEET!B$2:E$12,3,FALSE))","v":""}]
[null,null,null,null,{"$f":"IF(ISNA(VLOOKUP(D14,TAVOITTEET!B$2:D$12,2,FALSE)) = TRUE, \"\", VLOOKUP(D14,TAVOITTEET!B$2:D$12,2,FALSE))","v":""},{"$f":"IF(ISNA(VLOOKUP(D14,TAVOITTEET!B$2:E$12,3,FALSE)) = TRUE, \"\", VLOOKUP(D14,TAVOITTEET!B$2:E$12,3,FALSE))","v":""}]
[null,null,null,null,{"$f":"IF(ISNA(VLOOKUP(D15,TAVOITTEET!B$2:D$12,2,FALSE)) = TRUE, \"\", VLOOKUP(D15,TAVOITTEET!B$2:D$12,2,FALSE))","v":""},{"$f":"IF(ISNA(VLOOKUP(D15,TAVOITTEET!B$2:E$12,3,FALSE)) = TRUE, \"\", VLOOKUP(D15,TAVOITTEET!B$2:E$12,3,FALSE))","v":""}]
[null,null,null,null,{"$f":"IF(ISNA(VLOOKUP(D16,TAVOITTEET!B$2:D$12,2,FALSE)) = TRUE, \"\", VLOOKUP(D16,TAVOITTEET!B$2:D$12,2,FALSE))","v":""},{"$f":"IF(ISNA(VLOOKUP(D16,TAVOITTEET!B$2:E$12,3,FALSE)) = TRUE, \"\", VLOOKUP(D16,TAVOITTEET!B$2:E$12,3,FALSE))","v":""}]
[null,null,null,null,{"$f":"IF(ISNA(VLOOKUP(D17,TAVOITTEET!B$2:D$12,2,FALSE)) = TRUE, \"\", VLOOKUP(D17,TAVOITTEET!B$2:D$12,2,FALSE))","v":""},{"$f":"IF(ISNA(VLOOKUP(D17,TAVOITTEET!B$2:E$12,3,FALSE)) = TRUE, \"\", VLOOKUP(D17,TAVOITTEET!B$2:E$12,3,FALSE))","v":""}]
[null,null,null,null,{"$f":"IF(ISNA(VLOOKUP(D18,TAVOITTEET!B$2:D$12,2,FALSE)) = TRUE, \"\", VLOOKUP(D18,TAVOITTEET!B$2:D$12,2,FALSE))","v":""},{"$f":"IF(ISNA(VLOOKUP(D18,TAVOITTEET!B$2:E$12,3,FALSE)) = TRUE, \"\", VLOOKUP(D18,TAVOITTEET!B$2:E$12,3,FALSE))","v":""}]
[null,null,null,null,{"$f":"IF(ISNA(VLOOKUP(D19,TAVOITTEET!B$2:D$12,2,FALSE)) = TRUE, \"\", VLOOKUP(D19,TAVOITTEET!B$2:D$12,2,FALSE))","v":""},{"$f":"IF(ISNA(VLOOKUP(D19,TAVOITTEET!B$2:E$12,3,FALSE)) = TRUE, \"\", VLOOKUP(D19,TAVOITTEET!B$2:E$12,3,FALSE))","v":""}]
[null,null,null,null,{"$f":"IF(ISNA(VLOOKUP(D20,TAVOITTEET!B$2:D$12,2,FALSE)) = TRUE, \"\", VLOOKUP(D20,TAVOITTEET!B$2:D$12,2,FALSE))","v":""},{"$f":"IF(ISNA(VLOOKUP(D20,TAVOITTEET!B$2:E$12,3,FALSE)) = TRUE, \"\", VLOOKUP(D20,TAVOITTEET!B$2:E$12,3,FALSE))","v":""}]
[null,null,null,null,{"$f":"IF(ISNA(VLOOKUP(D21,TAVOITTEET!B$2:D$12,2,FALSE)) = TRUE, \"\", VLOOKUP(D21,TAVOITTEET!B$2:D$12,2,FALSE))","v":""},{"$f":"IF(ISNA(VLOOKUP(D21,TAVOITTEET!B$2:E$12,3,FALSE)) = TRUE, \"\", VLOOKUP(D21,TAVOITTEET!B$2:E$12,3,FALSE))","v":""}]
[null,null,null,null,{"$f":"IF(ISNA(VLOOKUP(D22,TAVOITTEET!B$2:D$12,2,FALSE)) = TRUE, \"\", VLOOKUP(D22,TAVOITTEET!B$2:D$12,2,FALSE))","v":""},{"$f":"IF(ISNA(VLOOKUP(D22,TAVOITTEET!B$2:E$12,3,FALSE)) = TRUE, \"\", VLOOKUP(D22,TAVOITTEET!B$2:E$12,3,FALSE))","v":""}]
[null,null,null,null,{"$f":"IF(ISNA(VLOOKUP(D23,TAVOITTEET!B$2:D$12,2,FALSE)) = TRUE, \"\", VLOOKUP(D23,TAVOITTEET!B$2:D$12,2,FALSE))","v":""},{"$f":"IF(ISNA(VLOOKUP(D23,TAVOITTEET!B$2:E$12,3,FALSE)) = TRUE, \"\", VLOOKUP(D23,TAVOITTEET!B$2:E$12,3,FALSE))","v":""}]
[null,null,null,null,{"$f":"IF(ISNA(VLOOKUP(D24,TAVOITTEET!B$2:D$12,2,FALSE)) = TRUE, \"\", VLOOKUP(D24,TAVOITTEET!B$2:D$12,2,FALSE))","v":""},{"$f":"IF(ISNA(VLOOKUP(D24,TAVOITTEET!B$2:E$12,3,FALSE)) = TRUE, \"\", VLOOKUP(D24,TAVOITTEET!B$2:E$12,3,FALSE))","v":""}]
[null,null,null,null,{"$f":"IF(ISNA(VLOOKUP(D25,TAVOITTEET!B$2:D$12,2,FALSE)) = TRUE, \"\", VLOOKUP(D25,TAVOITTEET!B$2:D$12,2,FALSE))","v":""},{"$f":"IF(ISNA(VLOOKUP(D25,TAVOITTEET!B$2:E$12,3,FALSE)) = TRUE, \"\", VLOOKUP(D25,TAVOITTEET!B$2:E$12,3,FALSE))","v":""}]
[null,null,null,null,{"$f":"IF(ISNA(VLOOKUP(D26,TAVOITTEET!B$2:D$12,2,FALSE)) = TRUE, \"\", VLOOKUP(D26,TAVOITTEET!B$2:D$12,2,FALSE))","v":""},{"$f":"IF(ISNA(VLOOKUP(D26,TAVOITTEET!B$2:E$12,3,FALSE)) = TRUE, \"\", VLOOKUP(D26,TAVOITTEET!B$2:E$12,3,FALSE))","v":""}]
[null,null,null,null,{"$f":"IF(ISNA(VLOOKUP(D27,TAVOITTEET!B$2:D$12,2,FALSE)) = TRUE, \"\", VLOOKUP(D27,TAVOITTEET!B$2:D$12,2,FALSE))","v":""},{"$f":"IF(ISNA(VLOOKUP(D27,TAVOITTEET!B$2:E$12,3,FALSE)) = TRUE, \"\", VLOOKUP(D27,TAVOITTEET!B$2:E$12,3,FALSE))","v":""}]
[null,null,null,null,{"$f":"IF(ISNA(VLOOKUP(D28,TAVOITTEET!B$2:D$12,2,FALSE)) = TRUE, \"\", VLOOKUP(D28,TAVOITTEET!B$2:D$12,2,FALSE))","v":""},{"$f":"IF(ISNA(VLOOKUP(D28,TAVOITTEET!B$2:E$12,3,FALSE)) = TRUE, \"\", VLOOKUP(D28,TAVOITTEET!B$2:E$12,3,FALSE))","v":""}]
[null,null,null,null,{"$f":"IF(ISNA(VLOOKUP(D29,TAVOITTEET!B$2:D$12,2,FALSE)) = TRUE, \"\", VLOOKUP(D29,TAVOITTEET!B$2:D$12,2,FALSE))","v":""},{"$f":"IF(ISNA(VLOOKUP(D29,TAVOITTEET!B$2:E$12,3,FALSE)) = TRUE, \"\", VLOOKUP(D29,TAVOITTEET!B$2:E$12,3,FALSE))","v":""}]
[null,null,null,null,{"$f":"IF(ISNA(VLOOKUP(D30,TAVOITTEET!B$2:D$12,2,FALSE)) = TRUE, \"\", VLOOKUP(D30,TAVOITTEET!B$2:D$12,2,FALSE))","v":""},{"$f":"IF(ISNA(VLOOKUP(D30,TAVOITTEET!B$2:E$12,3,FALSE)) = TRUE, \"\", VLOOKUP(D30,TAVOITTEET!B$2:E$12,3,FALSE))","v":""}]
{"$rows_left_out":223}
{"sheet":"VUOSISUUNNITELMA","index":1,"n_rows":56,"n_cols":52,"rows_kept":56,"cut":false,"hidden":false,"merged":[[4,6,5,6],[4,1,5,1],[4,2,5,2],[4,3,5,3],[4,4,5,4],[4,5,5,5]]}
[null,"Vuosisuunnitelma"]
[null,null,null,null,null,null,null,"Viikon korostus:",32,null,null,"Suunniteltu kesto",null,null,null,null,null,"Todellinen aloitus",null,null,null,null,null,"Todellinen (yli suunnitellun)"]
[]
[null,null,null,null,null,null,null,"Lukuvuosi",null,null,null,{"$f":"IF(L5<8, \"syys\", \"\")","v":""},{"$f":"IF(M5<8, \"syys\", \"\")","v":"syys"},{"$f":"IF(N5<8, \"syys\", \"\")","v":""},{"$f":"IF(O5<8, \"syys\", \"\")","v":""},null,{"$f":"IF(Q5<8, \"loka\", \"\")","v":""},{"$f":"IF(R5<8, \"loka\", \"\")","v":"loka"},{"$f":"IF(S5<8, \"loka\", \"\")","v":""},null,{"$f":"IF(U5<8, \"marras\", \"\")","v":""},{"$f":"IF(V5<8, \"marras\", \"\")","v":"marras"},{"$f":"IF(W5<8, \"marras\", \"\")","v":""},null,{"$f":"IF(Y5<8, \"joulu\",\"\")","v":""},{"$f":"IF(Z5<8, \"joulu\",\"\")","v":"joulu"},{"$f":"IF(AA5<8, \"joulu\",\"\")","v":""},null,null,{"$f":"IF(AD5<8, \"tammi\", \"\")","v":""},{"$f":"IF(AE5<8, \"tammi\", \"\")","v":"tammi"},null,null,{"$f":"IF(AH5<8, \"helmi\", \"\")","v":""},{"$f":"IF(AI5<8, \"helmi\", \"\")","v":"helmi"},{"$f":"IF(AJ5<8, \"helmi\", \"\")","v":""},null,{"$f":"IF(AL5<8, \"maalis\", \"\")","v":""},{"$f":"IF(AM5<8, \"maalis\", \"\")","v":"maalis"},{"$f":"IF(AN5<8, \"maalis\", \"\")","v":""},null,null,{"$f":"IF(AQ5<8, \"huhti\", \"\")","v":""},{"$f":"IF(AR5<8, \"huhti\", \"\")","v":"huhti"},{"$f":"IF(AS5<8, \"huhti\", \"\")","v":""},null,{"$f":"IF(AU5<8, \"touko\", \"\")","v":""},{"$f":"IF(AV5<8, \"touko\", \"\")","v":"touko"},{"$f":"IF(AW5<8, \"touko\", \"\")","v":""},null,{"$f":"IF(AY5<8, \"kesä\", \"\")","v":""},{"$f":"IF(AZ5<8, \"kesä\", \"\")","v":"kesä"}]
[null,"OPINTOKOKONAISUUS","OPINTOKOKONAISUUDEN NIMI","ALOITUSVIIKKO","SUUNNITELTU KESTO","TODELLINEN ALOITUS","TODELLINEN KESTO","2019-2020",{"$f":"VLOOKUP($H$5,LUKUVUOSITIEDOT!$D:$AV,2,FALSE)","v":5},{"$f":"VLOOKUP($H$5,LUKUVUOSITIEDOT!$D:$AV,3,FALSE)","v":12},{"$f":"VLOOKUP($H$5,LUKUVUOSITIEDOT!$D:$AV,4,FALSE)","v":19},{"$f":"VLOOKUP($H$5,LUKUVUOSITIEDOT!$D:$AV,5,FALSE)","v":26},{"$f":"VLOOKUP($H$5,LUKUVUOSITIEDOT!$D:$AV,6,FALSE)","v":2},{"$f":"VLOOKUP($H$5,LUKUVUOSITIEDOT!$D:$AV,7,FALSE)","v":9},{"$f":"VLOOKUP($H$5,LUKUVUOSITIEDOT!$D:$AV,8,FALSE)","v":16},{"$f":"VLOOKUP($H$5,LUKUVUOSITIEDOT!$D:$AV,9,FALSE)","v":23},{"$f":"VLOOKUP($H$5,LUKUVUOSITIEDOT!$D:$AV,10,FALSE)","v":30},{"$f":"VLOOKUP($H$5,LUKUVUOSITIEDOT!$D:$AV,11,FALSE)","v":7},{"$f":"VLOOKUP($H$5,LUKUVUOSITIEDOT!$D:$AV,12,FALSE)","v":14},{"$f":"VLOOKUP($H$5,LUKUVUOSITIEDOT!$D:$AV,13,FALSE)","v":21},{"$f":"VLOOKUP($H$5,LUKUVUOSITIEDOT!$D:$AV,14,FALSE)","v":28},{"$f":"VLOOKUP($H$5,LUKUVUOSITIEDOT!$D:$AV,15,FALSE)","v":4},{"$f":"VLOOKUP($H$5,LUKUVUOSITIEDOT!$D:$AV,16,FALSE)","v":11},{"$f":"VLOOKUP($H$5,LUKUVUOSITIEDOT!$D:$AV,17,FALSE)","v":18},{"$f":"VLOOKUP($H$5,LUKUVUOSITIEDOT!$D:$AV,18,FALSE)","v":25},{"$f":"VLOOKUP($H$5,LUKUVUOSITIEDOT!$D:$AV,19,FALSE)","v":2},{"$f":"VLOOKUP($H$5,LUKUVUOSITIEDOT!$D:$AV,20,FALSE)","v":9},{"$f":"VLOOKUP($H$5,LUKUVUOSITIEDOT!$D:$AV,21,FALSE)","v":16},{"$f":"VLOOKUP($H$5,LUKUVUOSITIEDOT!$D:$AV,22,FALSE)","v":23},{"$f":"VLOOKUP($H$5,LUKUVUOSITIEDOT!$D:$AV,23,FALSE)","v":30},{"$f":"VLOOKUP($H$5,LUKUVUOSITIEDOT!$D:$AV,24,FALSE)","v":6},{"$f":"VLOOKUP($H$5,LUKUVUOSITIEDOT!$D:$AV,25,FALSE)","v":13},{"$f":"VLOOKUP($H$5,LUKUVUOSITIEDOT!$D:$AV,26,FALSE)","v":20},{"$f":"VLOOKUP($H$5,LUKUVUOSITIEDOT!$D:$AV,27,FALSE)","v":27},{"$f":"VLOOKUP($H$5,LUKUVUOSITIEDOT!$D:$AV,28,FALSE)","v":3},{"$f":"VLOOKUP($H$5,LUKUVUOSITIEDOT!$D:$AV,29,FALSE)","v":10},{"$f":"VLOOKUP($H$5,LUKUVUOSITIEDOT!$D:$AV,30,FALSE)","v":17},{"$f":"VLOOKUP($H$5,LUKUVUOSITIEDOT!$D:$AV,31,FALSE)","v":24},{"$f":"VLOOKUP($H$5,LUKUVUOSITIEDOT!$D:$AV,32,FALSE)","v":2},{"$f":"VLOOKUP($H$5,LUKUVUOSITIEDOT!$D:$AV,33,FALSE)","v":9},{"$f":"VLOOKUP($H$5,LUKUVUOSITIEDOT!$D:$AV,34,FALSE)","v":16},{"$f":"VLOOKUP($H$5,LUKUVUOSITIEDOT!$D:$AV,35,FALSE)","v":23},{"$f":"VLOOKUP($H$5,LUKUVUOSITIEDOT!$D:$AV,36,FALSE)","v":30},{"$f":"VLOOKUP($H$5,LUKUVUOSITIEDOT!$D:$AV,37,FALSE)","v":6},{"$f":"VLOOKUP($H$5,LUKUVUOSITIEDOT!$D:$AV,38,FALSE)","v":13},{"$f":"VLOOKUP($H$5,LUKUVUOSITIEDOT!$D:$AV,39,FALSE)","v":20},{"$f":"VLOOKUP($H$5,LUKUVUOSITIEDOT!$D:$AV,40,FALSE)","v":27},{"$f":"VLOOKUP($H$5,LUKUVUOSITIEDOT!$D:$AV,41,FALSE)","v":4},{"$f":"VLOOKUP($H$5,LUKUVUOSITIEDOT!$D:$AV,42,FALSE)","v":11},{"$f":"VLOOKUP($H$5,LUKUVUOSITIEDOT!$D:$AV,43,FALSE)","v":18},{"$f":"VLOOKUP($H$5,LUKUVUOSITIEDOT!$D:$AV,44,FALSE)","v":25},{"$f":"VLOOKUP($H$5,LUKUVUOSITIEDOT!$D:$AV,45,FALSE)","v":1}]
[null,null,null,null,null,null,null,null,32,33,34,35,36,37,38,39,40,41,42,43,44,45,46,47,48,49,50,51,52,1,2,3,4,5,6,7,8,9,10,11,12,13,14,15,16,17,18,19,20,21,22,23]
[null,1,{"$f":"IF(ISNA(VLOOKUP(B7,OPINTOKOKONAISUUDET!B$8:C$206,2,FALSE)) = TRUE, \"\", VLOOKUP(B7,OPINTOKOKONAISUUDET!B$8:C$206,2,FALSE))","v":""}]
[null,2,{"$f":"IF(ISNA(VLOOKUP(B8,OPINTOKOKONAISUUDET!B$8:C$206,2,FALSE)) = TRUE, \"\", VLOOKUP(B8,OPINTOKOKONAISUUDET!B$8:C$206,2,FALSE))","v":""}]
[null,3,{"$f":"IF(ISNA(VLOOKUP(B9,OPINTOKOKONAISUUDET!B$8:C$206,2,FALSE)) = TRUE, \"\", VLOOKUP(B9,OPINTOKOKONAISUUDET!B$8:C$206,2,FALSE))","v":""}]
[null,4,{"$f":"IF(ISNA(VLOOKUP(B10,OPINTOKOKONAISUUDET!B$8:C$206,2,FALSE)) = TRUE, \"\", VLOOKUP(B10,OPINTOKOKONAISUUDET!B$8:C$206,2,FALSE))","v":""}]
[null,5,{"$f":"IF(ISNA(VLOOKUP(B11,OPINTOKOKONAISUUDET!B$8:C$206,2,FALSE)) = TRUE, \"\", VLOOKUP(B11,OPINTOKOKONAISUUDET!B$8:C$206,2,FALSE))","v":""}]
[null,6,{"$f":"IF(ISNA(VLOOKUP(B12,OPINTOKOKONAISUUDET!B$8:C$206,2,FALSE)) = TRUE, \"\", VLOOKUP(B12,OPINTOKOKONAISUUDET!B$8:C$206,2,FALSE))","v":""}]
[null,7,{"$f":"IF(ISNA(VLOOKUP(B13,OPINTOKOKONAISUUDET!B$8:C$206,2,FALSE)) = TRUE, \"\", VLOOKUP(B13,OPINTOKOKONAISUUDET!B$8:C$206,2,FALSE))","v":""}]
[null,8,{"$f":"IF(ISNA(VLOOKUP(B14,OPINTOKOKONAISUUDET!B$8:C$206,2,FALSE)) = TRUE, \"\", VLOOKUP(B14,OPINTOKOKONAISUUDET!B$8:C$206,2,FALSE))","v":""}]
[null,9,{"$f":"IF(ISNA(VLOOKUP(B15,OPINTOKOKONAISUUDET!B$8:C$206,2,FALSE)) = TRUE, \"\", VLOOKUP(B15,OPINTOKOKONAISUUDET!B$8:C$206,2,FALSE))","v":""}]
[null,10,{"$f":"IF(ISNA(VLOOKUP(B16,OPINTOKOKONAISUUDET!B$8:C$206,2,FALSE)) = TRUE, \"\", VLOOKUP(B16,OPINTOKOKONAISUUDET!B$8:C$206,2,FALSE))","v":""}]
[null,11,{"$f":"IF(ISNA(VLOOKUP(B17,OPINTOKOKONAISUUDET!B$8:C$206,2,FALSE)) = TRUE, \"\", VLOOKUP(B17,OPINTOKOKONAISUUDET!B$8:C$206,2,FALSE))","v":""}]
[null,12,{"$f":"IF(ISNA(VLOOKUP(B18,OPINTOKOKONAISUUDET!B$8:C$206,2,FALSE)) = TRUE, \"\", VLOOKUP(B18,OPINTOKOKONAISUUDET!B$8:C$206,2,FALSE))","v":""}]
[null,13,{"$f":"IF(ISNA(VLOOKUP(B19,OPINTOKOKONAISUUDET!B$8:C$206,2,FALSE)) = TRUE, \"\", VLOOKUP(B19,OPINTOKOKONAISUUDET!B$8:C$206,2,FALSE))","v":""}]
[null,14,{"$f":"IF(ISNA(VLOOKUP(B20,OPINTOKOKONAISUUDET!B$8:C$206,2,FALSE)) = TRUE, \"\", VLOOKUP(B20,OPINTOKOKONAISUUDET!B$8:C$206,2,FALSE))","v":""}]
[null,15,{"$f":"IF(ISNA(VLOOKUP(B21,OPINTOKOKONAISUUDET!B$8:C$206,2,FALSE)) = TRUE, \"\", VLOOKUP(B21,OPINTOKOKONAISUUDET!B$8:C$206,2,FALSE))","v":""}]
[null,16,{"$f":"IF(ISNA(VLOOKUP(B22,OPINTOKOKONAISUUDET!B$8:C$206,2,FALSE)) = TRUE, \"\", VLOOKUP(B22,OPINTOKOKONAISUUDET!B$8:C$206,2,FALSE))","v":""}]
[null,17,{"$f":"IF(ISNA(VLOOKUP(B23,OPINTOKOKONAISUUDET!B$8:C$206,2,FALSE)) = TRUE, \"\", VLOOKUP(B23,OPINTOKOKONAISUUDET!B$8:C$206,2,FALSE))","v":""}]
[null,18,{"$f":"IF(ISNA(VLOOKUP(B24,OPINTOKOKONAISUUDET!B$8:C$206,2,FALSE)) = TRUE, \"\", VLOOKUP(B24,OPINTOKOKONAISUUDET!B$8:C$206,2,FALSE))","v":""}]
[null,19,{"$f":"IF(ISNA(VLOOKUP(B25,OPINTOKOKONAISUUDET!B$8:C$206,2,FALSE)) = TRUE, \"\", VLOOKUP(B25,OPINTOKOKONAISUUDET!B$8:C$206,2,FALSE))","v":""}]
[null,20,{"$f":"IF(ISNA(VLOOKUP(B26,OPINTOKOKONAISUUDET!B$8:C$206,2,FALSE)) = TRUE, \"\", VLOOKUP(B26,OPINTOKOKONAISUUDET!B$8:C$206,2,FALSE))","v":""}]
[null,21,{"$f":"IF(ISNA(VLOOKUP(B27,OPINTOKOKONAISUUDET!B$8:C$206,2,FALSE)) = TRUE, \"\", VLOOKUP(B27,OPINTOKOKONAISUUDET!B$8:C$206,2,FALSE))","v":""}]
[null,22,{"$f":"IF(ISNA(VLOOKUP(B28,OPINTOKOKONAISUUDET!B$8:C$206,2,FALSE)) = TRUE, \"\", VLOOKUP(B28,OPINTOKOKONAISUUDET!B$8:C$206,2,FALSE))","v":""}]
[null,23,{"$f":"IF(ISNA(VLOOKUP(B29,OPINTOKOKONAISUUDET!B$8:C$206,2,FALSE)) = TRUE, \"\", VLOOKUP(B29,OPINTOKOKONAISUUDET!B$8:C$206,2,FALSE))","v":""}]
[null,24,{"$f":"IF(ISNA(VLOOKUP(B30,OPINTOKOKONAISUUDET!B$8:C$206,2,FALSE)) = TRUE, \"\", VLOOKUP(B30,OPINTOKOKONAISUUDET!B$8:C$206,2,FALSE))","v":""}]
{"$rows_left_out":27}
{"sheet":"7. LUOKKA","index":2,"n_rows":15,"n_cols":10,"rows_kept":15,"cut":false,"hidden":false,"merged":[]}
[]
[null,"Lukuvuoden arvioitavat tavoitteet",null,null,null,"Sisällöt",null,null,"Arviointitavat"]
[null,null,"Suunnitelmassa kertaa",null,null,null,"Suunnitelmassa kertaa",null,null,"Suunnitelmassa kertaa"]
[null,"KUVATAIDE"]
[null,"T1",{"$f":"COUNTIF(OPINTOKOKONAISUUDET!$D$8:$D$252,\"T1*\")","v":0},null,null,"S1",{"$f":"COUNTIF(OPINTOKOKONAISUUDET!$G$8:$G$252,\"S1*\")","v":0},null,"Opettajan arviointi",{"$f":"COUNTIF(OPINTOKOKONAISUUDET!$I$8:$I$252,\"Opettajan arviointi\")","v":0}]
[null,"T2",{"$f":"COUNTIF(OPINTOKOKONAISUUDET!$D$8:$D$252,\"T2*\")","v":0},null,null,"S2",{"$f":"COUNTIF(OPINTOKOKONAISUUDET!$G$8:$G$252,\"S2*\")","v":0},null,"Itsearviointi",{"$f":"COUNTIF(OPINTOKOKONAISUUDET!$I$8:$I$252,\"Itsearviointi\")","v":0}]
[null,"T3",{"$f":"COUNTIF(OPINTOKOKONAISUUDET!$D$8:$D$252,\"T3*\")","v":0},null,null,"S3",{"$f":"COUNTIF(OPINTOKOKONAISUUDET!$G$8:$G$252,\"S3*\")","v":0},null,"Vertaisarviointi",{"$f":"COUNTIF(OPINTOKOKONAISUUDET!$I$8:$I$252,\"Vertaisarviointi\")","v":0}]
[null,"T4",{"$f":"COUNTIF(OPINTOKOKONAISUUDET!$D$8:$D$252,\"T4*\")","v":0},null,null,null,null,null,"Ryhmäarviointi",{"$f":"COUNTIF(OPINTOKOKONAISUUDET!$I$8:$I$252,\"Ryhmäarviointi\")","v":0}]
[null,"T5",{"$f":"COUNTIF(OPINTOKOKONAISUUDET!$D$8:$D$252,\"T5*\")","v":0},null,null,null,null,null,"Muu arviointi",{"$f":"COUNTIF(OPINTOKOKONAISUUDET!$I$8:$I$252,\"Muu arviointi\")","v":0}]
[null,"T6",{"$f":"COUNTIF(OPINTOKOKONAISUUDET!$D$8:$D$252,\"T6*\")","v":0}]
[null,"T7",{"$f":"COUNTIF(OPINTOKOKONAISUUDET!$D$8:$D$252,\"T7*\")","v":0}]
[null,"T8",{"$f":"COUNTIF(OPINTOKOKONAISUUDET!$D$8:$D$252,\"T8*\")","v":0}]
[null,"T9",{"$f":"COUNTIF(OPINTOKOKONAISUUDET!$D$8:$D$252,\"T9*\")","v":0}]
[null,"T10",{"$f":"COUNTIF(OPINTOKOKONAISUUDET!$D$8:$D$252,\"T10*\")","v":0}]
[null,"T11",{"$f":"COUNTIF(OPINTOKOKONAISUUDET!$D$8:$D$252,\"T11*\")","v":0}]

{"sheet":"8. LUOKKA","index":3,"n_rows":15,"n_cols":10,"rows_kept":15,"cut":false,"hidden":false,"merged":[]}
[]
[null,"Lukuvuoden arvioitavat tavoitteet",null,null,null,"Sisällöt",null,null,"Arviointitavat"]
[null,null,"Suunnitelmassa kertaa",null,null,null,"Suunnitelmassa kertaa",null,null,"Suunnitelmassa kertaa"]
[null,"KUVATAIDE"]
[null,"T1",{"$f":"COUNTIF(OPINTOKOKONAISUUDET!$D$8:$D$252,\"T1*\")","v":0},null,null,"S1",{"$f":"COUNTIF(OPINTOKOKONAISUUDET!$G$8:$G$252,\"S1*\")","v":0},null,"Opettajan arviointi",{"$f":"COUNTIF(OPINTOKOKONAISUUDET!$I$8:$I$252,\"Opettajan arviointi\")","v":0}]
[null,"T2",{"$f":"COUNTIF(OPINTOKOKONAISUUDET!$D$8:$D$252,\"T2*\")","v":0},null,null,"S2",{"$f":"COUNTIF(OPINTOKOKONAISUUDET!$G$8:$G$252,\"S2*\")","v":0},null,"Itsearviointi",{"$f":"COUNTIF(OPINTOKOKONAISUUDET!$I$8:$I$252,\"Itsearviointi\")","v":0}]
[null,"T3",{"$f":"COUNTIF(OPINTOKOKONAISUUDET!$D$8:$D$252,\"T3*\")","v":0},null,null,"S3",{"$f":"COUNTIF(OPINTOKOKONAISUUDET!$G$8:$G$252,\"S3*\")","v":0},null,"Vertaisarviointi",{"$f":"COUNTIF(OPINTOKOKONAISUUDET!$I$8:$I$252,\"Vertaisarviointi\")","v":0}]
[null,"T4",{"$f":"COUNTIF(OPINTOKOKONAISUUDET!$D$8:$D$252,\"T4*\")","v":0},null,null,null,null,null,"Ryhmäarviointi",{"$f":"COUNTIF(OPINTOKOKONAISUUDET!$I$8:$I$252,\"Ryhmäarviointi\")","v":0}]
[null,"T5",{"$f":"COUNTIF(OPINTOKOKONAISUUDET!$D$8:$D$252,\"T5*\")","v":0},null,null,null,null,null,"Muu arviointi",{"$f":"COUNTIF(OPINTOKOKONAISUUDET!$I$8:$I$252,\"Muu arviointi\")","v":0}]
[null,"T6",{"$f":"COUNTIF(OPINTOKOKONAISUUDET!$D$8:$D$252,\"T6*\")","v":0}]
[null,"T7",{"$f":"COUNTIF(OPINTOKOKONAISUUDET!$D$8:$D$252,\"T7*\")","v":0}]
[null,"T8",{"$f":"COUNTIF(OPINTOKOKONAISUUDET!$D$8:$D$252,\"T8*\")","v":0}]
[null,"T9",{"$f":"COUNTIF(OPINTOKOKONAISUUDET!$D$8:$D$252,\"T9*\")","v":0}]
[null,"T10",{"$f":"COUNTIF(OPINTOKOKONAISUUDET!$D$8:$D$252,\"T10*\")","v":0}]
[null,"T11",{"$f":"COUNTIF(OPINTOKOKONAISUUDET!$D$8:$D$252,\"T11*\")","v":0}]

{"sheet":"9. LUOKKA","index":4,"n_rows":15,"n_cols":10,"rows_kept":15,"cut":false,"hidden":false,"merged":[]}
[]
[null,"Lukuvuoden arvioitavat tavoitteet",null,null,null,"Sisällöt",null,null,"Arviointitavat"]
[null,null,"Suunnitelmassa kertaa",null,null,null,"Suunnitelmassa kertaa",null,null,"Suunnitelmassa kertaa"]
[null,"KUVATAIDE"]
[null,"T1",{"$f":"COUNTIF(OPINTOKOKONAISUUDET!$D$8:$D$252,\"T1*\")","v":0},null,null,"S1",{"$f":"COUNTIF(OPINTOKOKONAISUUDET!$G$8:$G$252,\"S1*\")","v":0},null,"Opettajan arviointi",{"$f":"COUNTIF(OPINTOKOKONAISUUDET!$I$8:$I$252,\"Opettajan arviointi\")","v":0}]
[null,"T2",{"$f":"COUNTIF(OPINTOKOKONAISUUDET!$D$8:$D$252,\"T2*\")","v":0},null,null,"S2",{"$f":"COUNTIF(OPINTOKOKONAISUUDET!$G$8:$G$252,\"S2*\")","v":0},null,"Itsearviointi",{"$f":"COUNTIF(OPINTOKOKONAISUUDET!$I$8:$I$252,\"Itsearviointi\")","v":0}]
[null,"T3",{"$f":"COUNTIF(OPINTOKOKONAISUUDET!$D$8:$D$252,\"T3*\")","v":0},null,null,"S3",{"$f":"COUNTIF(OPINTOKOKONAISUUDET!$G$8:$G$252,\"S3*\")","v":0},null,"Vertaisarviointi",{"$f":"COUNTIF(OPINTOKOKONAISUUDET!$I$8:$I$252,\"Vertaisarviointi\")","v":0}]
[null,"T4",{"$f":"COUNTIF(OPINTOKOKONAISUUDET!$D$8:$D$252,\"T4*\")","v":0},null,null,null,null,null,"Ryhmäarviointi",{"$f":"COUNTIF(OPINTOKOKONAISUUDET!$I$8:$I$252,\"Ryhmäarviointi\")","v":0}]
[null,"T5",{"$f":"COUNTIF(OPINTOKOKONAISUUDET!$D$8:$D$252,\"T5*\")","v":0},null,null,null,null,null,"Muu arviointi",{"$f":"COUNTIF(OPINTOKOKONAISUUDET!$I$8:$I$252,\"Muu arviointi\")","v":0}]
[null,"T6",{"$f":"COUNTIF(OPINTOKOKONAISUUDET!$D$8:$D$252,\"T6*\")","v":0}]
[null,"T7",{"$f":"COUNTIF(OPINTOKOKONAISUUDET!$D$8:$D$252,\"T7*\")","v":0}]
[null,"T8",{"$f":"COUNTIF(OPINTOKOKONAISUUDET!$D$8:$D$252,\"T8*\")","v":0}]
[null,"T9",{"$f":"COUNTIF(OPINTOKOKONAISUUDET!$D$8:$D$252,\"T9*\")","v":0}]
[null,"T10",{"$f":"COUNTIF(OPINTOKOKONAISUUDET!$D$8:$D$252,\"T10*\")","v":0}]
[null,"T11",{"$f":"COUNTIF(OPINTOKOKONAISUUDET!$D$8:$D$252,\"T11*\")","v":0}]

{"sheet":"TAVOITTEET","index":5,"n_rows":17,"n_cols":4,"rows_kept":17,"cut":false,"hidden":false,"merged":[]}
[null,"TAVOITE","ARVIOINNIN KOHDE","TAVOITETEKSTI"]
[null,"T1 KUVATAIDE","Taiteen, ympäristön ja muun visuaalisen kulttuurin havainnoiminen","kannustaa oppilasta havainnoimaan, taidetta, ympäristöä ja muuta visuaalista kulttuuria moniaistisesti ja käyttämään monipuolisesti kuvallisen tuottamisen menetelmiä"]
[null,"T2 KUVATAIDE","Havaintojen ja ajattelun vaikutusten pohtiminen","rohkaista oppilasta keskustelemaan omista ja muiden havainnoista ja ajatuksista sekä perustelemaan näkemyksiään"]
[null,"T3 KUVATAIDE","Havaintojen ja ajatusten kuvallinen ilmaiseminen","innostaa oppilasta ilmaisemaan havaintojaan ja ajatuksiaan kuvallisesti erilaisia välineitä ja tiedon tuottamisen tapoja käyttäen eri ympäristöissä"]
[null,"T4 KUVATAIDE","Kuvailmaisun taitojen syventäminen","ohjata oppilasta soveltamaan erilaisia materiaaleja, tekniikoita ja ilmaisun keinoja sekä syventämään kuvallisen tuottamisen taitojaan"]
[null,"T5 KUVATAIDE","Tutkivan lähestymistavan käyttäminen","ohjata oppilasta tutkivaan lähestymistapaan itsenäisessä ja yhteistoiminnallisessa kuvallisessa työskentelyssä"]
[null,"T6 KUVATAIDE","Kuvallisen tuottamisen avulla vaikuttaminen"," rohkaista oppilasta ilmaisemaan mielipiteitään sekä soveltamaan kuvallisen viestinnän ja vaikuttamisen keinoja omissa kuvissaan"]
[null,"T7 KUVATAIDE","Kuvatulkinnan menetelmien soveltaminen","ohjata oppilasta soveltamaan kuvallisia, sanallisia ja muita kuvatulkinnan menetelmiä"]
[null,"T8 KUVATAIDE","Visuaalisen kulttuurin merkityksen tarkasteleminen","ohjata oppilasta tarkastelemaan taiteen ja muun visuaalisen kulttuurin merkitystä yksilölle, yhteisölle ja yhteiskunnalle historian ja kulttuurin näkökulmista"]
[null,"T9 KUVATAIDE","Kulttuuristen kuvailmaisun tapojen soveltaminen","innostaa oppilasta soveltamaan eri aikojen ja kulttuurien kuvailmaisun tapoja kuvallisessa tuottamisessaan"]
[null,"T10 KUVATAIDE","Näkemysten esittäminen","ohjata oppilasta ottamaan kantaa taiteessa, ympäristössä ja muussa visuaalisessa kulttuurissa ilmeneviin arvoihin"]
[null,"T11 KUVATAIDE","Näkemysten esittäminen"," kannustaa oppilasta ottamaan kuvailmaisussaan huomioon kulttuurinen moninaisuus ja kestävä kehitys sekä vaikuttamaan kuvien avulla"]
[]
[null,"Sisällöt"]
[null,"S1 Omat kuvakulttuurit"]
[null,"S2 Ympäristön kuvakulttuurit"]
[null,"S3 Taiteen maailmat"]

{"sheet":"TIEDOT","index":6,"n_rows":59,"n_cols":2,"rows_kept":59,"cut":false,"hidden":false,"merged":[]}
[]
[null,"ARVIOINTI"]
[null,"Opettajan arviointi"]
[null,"Itsearviointi"]
[null,"Vertaisarviointi"]
[null,"Ryhmäarviointi"]
[null,"Muu arviointi"]
[]
[null,"OPINTOKOKONAISUUDET"]
[null,1]
[null,2]
[null,3]
[null,4]
[null,5]
[null,6]
[null,7]
[null,8]
[null,9]
[null,10]
[null,11]
[null,12]
[null,13]
[null,14]
[null,15]
[null,16]
[null,17]
[null,18]
[null,19]
[null,20]
[null,21]
{"$rows_left_out":30}
{"sheet":"LUKUVUOSITIEDOT","index":7,"n_rows":18,"n_cols":48,"rows_kept":18,"cut":false,"hidden":false,"merged":[]}
[]
[null,null,null,"Lukuvuosi"]
[]
[null,null,null,null,"VIIKOT"]
[null,"2019-2020",null,"2019-2020",5,12,19,26,2,9,16,23,30,7,14,21,28,4,11,18,25,2,9,16,23,30,6,13,20,27,3,10,17,24,2,9,16,23,30,6,13,20,27,4,11,18,25,1]
[null,"2020-2021",null,null,32,33,34,35,36,37,38,39,40,41,42,43,44,45,46,47,48,49,50,51,52,1,2,3,4,5,6,7,8,9,10,11,12,13,14,15,16,17,18,19,20,21,22,23]
[null,"2021-2022"]
[null,"2022-2023",null,null,"VIIKOT"]
[null,null,null,"2020-2021",3,10,17,24,31,7,14,21,28,5,12,19,26,2,9,16,23,30,7,14,21,28,4,11,18,25,1,8,15,22,1,8,15,22,29,5,12,19,26,3,10,17,24,31]
[null,null,null,null,32,33,34,35,36,37,38,39,40,41,42,43,44,45,46,47,48,49,50,51,52,1,2,3,4,5,6,7,8,9,10,11,12,13,14,15,16,17,18,19,20,21,22,23]
[]
[null,null,null,null,"VIIKOT"]
[null,null,null,"2021-2022",9,16,23,30,6,13,20,27,4,11,18,25,1,8,15,22,29,6,13,20,27,3,10,17,24,31,7,14,21,28,7,14,21,28,4,11,18,25,2,9,16,23,30,6]
[null,null,null,null,32,33,34,35,36,37,38,39,40,41,42,43,44,45,46,47,48,49,50,51,52,1,2,3,4,5,6,7,8,9,10,11,12,13,14,15,16,17,18,19,20,21,22,23]
[]
[null,null,null,null,"VIIKOT"]
[null,null,null,"2022-2023",8,15,22,29,5,12,19,26,3,10,17,24,31,7,14,21,28,5,12,19,26,2,9,16,23,30,6,13,20,27,6,13,20,27,3,10,17,24,1,8,15,22,29,5]
[null,null,null,null,32,33,34,35,36,37,38,39,40,41,42,43,44,45,46,47,48,49,50,51,52,1,2,3,4,5,6,7,8,9,10,11,12,13,14,15,16,17,18,19,20,21,22,23]